{"text_format":"1","workbook":"xlsx","n_sheets":9,"sheets":["Lista uczniów","ogólnie","ndst","nkl","zachowanie","do druku","Ust","do druku 2","przedmiotami"],"not_rendered":{"charts":0,"images":0,"macros":1,"external_links":0,"defined_names":5,"comments":2,"pivot_tables":0},"unopened":[],"bounds":{"document_bytes":16777216,"sheet_cells":100000,"rows_first":2000,"rows_last":500,"rows_between":2000,"halvings":0,"cell_chars":16384,"cell_head_chars":4096},"cells_cut":0,"cells_raw":0,"read":"whole","date_system":"1900"}

{"sheet":"Lista uczniów","index":0,"n_rows":48,"n_cols":4,"rows_kept":48,"cut":false,"hidden":false,"merged":[]}
[null,"Lista uczniów klasy"]
[]
["Nr","Nazwisko i imię ","promowany","wyróżnienie"]
[1]
[2]
[3]
[4]
[5]
[6]
[7]
[8]
[9]
[10]
[11]
[12]
[13]
[14]
[15]
[16]
[17]
[18]
[19]
[20]
[21]
[22]
[23]
[24]
[25]
[26]
[27]
[28]
[29]
[30]
[31]
[32]
[33]
[34]
[35]
[36]
[37]
[38]
[39]
[40]
[41]
[42]
[43]
[44]
[45]

{"sheet":"ogólnie","index":1,"n_rows":35,"n_cols":4,"rows_kept":35,"cut":false,"hidden":false,"merged":[[0,0,0,1]]}
["Arkusz klasyfikacyjny"]
[]
["Semestr","pierwszy"]
[]
["Rok szkolny"]
[]
["KLASA"]
["STAN KLASY",null,null,{"$f":"IF(B8=(B9+B10),\"OK\",\"BŁĄD\")","v":"OK"}]
["KLASYFIKOWANYCH:"]
["NIEKLASYFIKOWANYCH:"]
["z 1 przedmiotu"]
["z 2 przedmiotów"]
["z 3 i więcej przedmiotów",null,null,{"$f":"IF(B10=(B11+B12+B13),\"OK\",\"BŁĄD\")","v":"OK"}]
["NIEDOSTATECZNE"]
["bez ocen niedostatecznych"]
["z 1 oceną niedostateczną"]
["z 2 ocenami niedostatecznymi"]
["z 3 ocenami niedostatecznymi i więcej"]
[null,null,null,{"$f":"IF(B8=(B15+B16+B17+B18),\"OK\",\"BŁĄD\")","v":"OK"}]
["ŚREDNIA OCEN"]
["ŚREDNIA FREKWENCJA "]
["PROMOWANYCH:"]
["PROMOWANYCH Z WYRÓŻNIENIEM"]
["NIEPROMOWANYCH:"]
["DO EGZAMINU POPRAWKOWEGO"]
["DO EGZAMINU KLASYFIKACYJNEGO"]
["ZACHOWANIE:"]
["Wzorowe"]
["Bardzo dobre"]
["Dobre"]
["Poprawne"]
["Nieodpowiednie"]
["Naganne",null,null,{"$f":"IF(B8=(B28+B29+B30+B31+B32+B33),\"OK\",\"BŁĄD\")","v":"OK"}]
[]
["."]

{"sheet":"ndst","index":2,"n_rows":37,"n_cols":17,"rows_kept":37,"cut":false,"hidden":false,"merged":[]}
["Imię Nazwisko","Przedmiot1","Przedmiot2","Przedmiot3","Przedmiot4","Przedmiot5","Przedmiot6","Przedmiot7","Przedmiot8","Przedmiot9","Przedmiot10","Przedmiot11","Przedmiot12","Przedmiot13","Przedmiot14","Przedmiot15","Przedmiot16"]
[]
[]
[]
[]
[]
[]
[]
[]
[]
[]
[]
[]
[]
[]
[]
[]
[]
[]
[]
[]
[]
[]
[]
[]
[]
[]
[]
[]
[]
[]
[]
[]
[]
[]
[]
[null,{"$f":"IF(COUNTA(B2:B36)=(ogólnie!B16+ogólnie!B17+ogólnie!B18),\"OK\",\"BŁĄD\")","v":"OK"},{"$f":"IF(COUNTA(C2:C36)=(ogólnie!B17+ogólnie!B18),\"OK\",\"BŁĄD\")","v":"OK"},{"$f":"IF(COUNTA(D2:D36)=ogólnie!B18,\"OK\",\"BŁĄD\")","v":"OK"}]

{"sheet":"nkl","index":3,"n_rows":37,"n_cols":17,"rows_kept":37,"cut":false,"hidden":false,"merged":[]}
["Imię Nazwisko","Przedmiot1","Przedmiot2","Przedmiot3","Przedmiot4","Przedmiot5","Przedmiot6","Przedmiot7","Przedmiot8","Przedmiot9","Przedmiot10","Przedmiot11","Przedmiot12","Przedmiot13","Przedmiot14","Przedmiot15","Przedmiot16"]
[]
[]
[]
[]
[]
[]
[]
[]
[]
[]
[]
[]
[]
[]
[]
[]
[]
[]
[]
[]
[]
[]
[]
[]
[]
[]
[]
[]
[]
[]
[]
[]
[]
[]
[]
[null,{"$f":"IF(COUNTA(B2:B36)=(ogólnie!B11+ogólnie!B12+ogólnie!B13),\"OK\",\"BŁĄD\")","v":"OK"},{"$f":"IF(COUNTA(C2:C36)=(ogólnie!B12+ogólnie!B13),\"OK\",\"BŁĄD\")","v":"OK"},{"$f":"IF(COUNTA(D2:D36)=ogólnie!B13,\"OK\",\"BŁĄD\")","v":"OK"}]

{"sheet":"zachowanie","index":4,"n_rows":42,"n_cols":6,"rows_kept":42,"cut":false,"hidden":false,"merged":[]}
["Wzorowe","Bardzo Dobre","Dobre","Poprawne","Nieodpowiednie","Naganne"]
[]
[]
[]
[]
[]
[]
[]
[]
[]
[]
[]
[]
[]
[]
[]
[]
[]
[]
[]
[]
[]
[]
[]
[]
[]
[]
[]
[]
[]
[]
[]
[]
[]
[]
[]
[]
[]
[]
[]
[]
[{"$f":"IF(COUNTA(A2:A41)=ogólnie!B28,\"OK\",\"BŁĄD\")","v":"OK"},{"$f":"IF(COUNTA(B2:B41)=ogólnie!B29,\"OK\",\"BŁĄD\")","v":"OK"},{"$f":"IF(COUNTA(C2:C41)=ogólnie!B30,\"OK\",\"BŁĄD\")","v":"OK"},{"$f":"IF(COUNTA(D2:D41)=ogólnie!B31,\"OK\",\"BŁĄD\")","v":"OK"},{"$f":"IF(COUNTA(E2:E41)=ogólnie!B32,\"OK\",\"BŁĄD\")","v":"OK"},{"$f":"IF(COUNTA(F2:F41)=ogólnie!B33,\"OK\",\"BŁĄD\")","v":"OK"}]

{"sheet":"do druku","index":5,"n_rows":42,"n_cols":2,"rows_kept":42,"cut":false,"hidden":true,"merged":[[35,0,35,1]]}
["Zasadnicza Szkoła Zawodowa Nr 1","Arkusz klasyfikacyjny"]
[]
[]
["Rok szkolny",{"$f":"ogólnie!B5","v":0}]
["Semestr",{"$f":"ogólnie!B3","v":"pierwszy"}]
[]
["KLASA",{"$f":"ogólnie!B7","v":0}]
["STAN KLASY",{"$f":"ogólnie!B8","v":0}]
["KLASYFIKOWANYCH:",{"$f":"ogólnie!B9","v":0}]
["NIEKLASYFIKOWANYCH:",{"$f":"ogólnie!B10","v":0}]
["z 1 przedmiotu",{"$f":"ogólnie!B11","v":0}]
["z 2 przedmiotów",{"$f":"ogólnie!B12","v":0}]
["z 3 i więcej przedmiotów",{"$f":"ogólnie!B13","v":0}]
["NIEDOSTATECZNE",{"$f":"ogólnie!B14","v":0}]
["bez ocen niedostatecznych",{"$f":"ogólnie!B15","v":0}]
["z 1 oceną niedostateczną",{"$f":"ogólnie!B16","v":0}]
["z 2 ocenami niedostatecznymi",{"$f":"ogólnie!B17","v":0}]
["z 3 ocenami niedostatecznymi i więcej",{"$f":"ogólnie!B18","v":0}]
[]
["ŚREDNIA OCEN",{"$f":"ogólnie!B20","v":0}]
["ŚREDNIA FREKWENCJA ",{"$f":"ogólnie!B21","v":0}]
["PROMOWANYCH:",{"$f":"ogólnie!B22","v":0}]
["PROMOWANYCH Z WYRÓŻNIENIEM",{"$f":"ogólnie!B23","v":0}]
["NIEPROMOWANYCH:",{"$f":"ogólnie!B24","v":0}]
["DO EGZAMINU POPRAWKOWEGO",{"$f":"ogólnie!B25","v":0}]
["DO EGZAMINU KLASYFIKACYJNEGO",{"$f":"ogólnie!B26","v":0}]
["ZACHOWANIE:",{"$f":"ogólnie!B27","v":0}]
["wzorowe",{"$f":"ogólnie!B28","v":0}]
["bardzo dobre",{"$f":"ogólnie!B29","v":0}]
["dobre",{"$f":"ogólnie!B30","v":0}]
["poprawne",{"$f":"ogólnie!B31","v":0}]
["nieodpowiednie",{"$f":"ogólnie!B32","v":0}]
["naganne",{"$f":"ogólnie!B33","v":0}]
[]
[]
["ZACHOWANIE"]
["wzorowe"]
["bardzo dobre"]
["dobre"]
["poprawne"]
["nieodpowiednie"]
["naganne"]

{"sheet":"Ust","index":6,"n_rows":100,"n_cols":5,"rows_kept":100,"cut":false,"hidden":true,"merged":[]}
[null,"rok szkolny","Wybierz klasę"]
[null,"2014/2015","1A ZS"]
[null,null,"2A ZS"]
[null,null,"3A ZS"]
[]
[]
[]
[]
[]
[]
[]
[]
[]
[]
[]
[]
[]
[]
[]
[]
[]
[]
[]
[]
[]
[]
[]
[]
[]
[]
[]
[]
[]
[]
[]
[]
[]
[]
[]
[]
[]
[]
[]
[]
[]
[]
[]
[]
[]
[]
[]
[]
[]
[]
[]
[]
[]
[]
[]
[]
[]
[]
[]
[]
[]
[]
[]
[]
[]
[]
[]
[]
[]
[]
[]
[]
[]
[]
[]
[]
[]
[]
[]
[]
[]
[]
[]
[]
[]
[]
[]
[]
[]
[]
[]
[]
[]
[]
[]
[null,null,null,"stan klasy",15]

{"sheet":"do druku 2","index":7,"n_rows":2,"n_cols":6,"rows_kept":2,"cut":false,"hidden":true,"merged":[[0,0,0,4]]}
["zestawienie uczniów",null,null,null,null,{"$f":"ogólnie!B7","v":0}]
["lp","nazwisko i imię ","promowany","wyróżnienie","oceny niedostateczne przedmioty","nieklasyfikowanie  przedmioty"]

{"sheet":"przedmiotami","index":8,"n_rows":319,"n_cols":28,"rows_kept":319,"cut":false,"hidden":true,"merged":[]}
["lp","Przedmiot","liczba ndst","liczba nkl","info czy są ndst"]
[1,"bezpieczeństwo w gastronomii",{"$f":"IF(COUNTIF(ndst!$A$2:$Q$36,B2)=0,\"\",COUNTIF(ndst!$A$2:$Q$36,B2))","v":""},{"$f":"IF(COUNTIF(nkl!$A$2:$Q$36,B2)=0,\"\",COUNTIF(nkl!$A$2:$Q$36,B2))","v":""},{"$f":"IF(C2&D2<>\"\",\"tak\",\"-\")","v":"-"}]
[2,"biologia",{"$f":"IF(COUNTIF(ndst!$A$2:$Q$36,B3)=0,\"\",COUNTIF(ndst!$A$2:$Q$36,B3))","v":""},{"$f":"IF(COUNTIF(nkl!$A$2:$Q$36,B3)=0,\"\",COUNTIF(nkl!$A$2:$Q$36,B3))","v":""},{"$f":"IF(C3&D3<>\"\",\"tak\",\"-\")","v":"-"}]
[3,"chemia",{"$f":"IF(COUNTIF(ndst!$A$2:$Q$36,B4)=0,\"\",COUNTIF(ndst!$A$2:$Q$36,B4))","v":""},{"$f":"IF(COUNTIF(nkl!$A$2:$Q$36,B4)=0,\"\",COUNTIF(nkl!$A$2:$Q$36,B4))","v":""},"-"]
[4,"działalność gospodarcza w gastronomii",{"$f":"IF(COUNTIF(ndst!$A$2:$Q$36,B5)=0,\"\",COUNTIF(ndst!$A$2:$Q$36,B5))","v":""},{"$f":"IF(COUNTIF(nkl!$A$2:$Q$36,B5)=0,\"\",COUNTIF(nkl!$A$2:$Q$36,B5))","v":""},"-"]
[5,"edukacja dla bezpieczeństwa",{"$f":"IF(COUNTIF(ndst!$A$2:$Q$36,B6)=0,\"\",COUNTIF(ndst!$A$2:$Q$36,B6))","v":""},{"$f":"IF(COUNTIF(nkl!$A$2:$Q$36,B6)=0,\"\",COUNTIF(nkl!$A$2:$Q$36,B6))","v":""},"-"]
[6,"fizyka",{"$f":"IF(COUNTIF(ndst!$A$2:$Q$36,B7)=0,\"\",COUNTIF(ndst!$A$2:$Q$36,B7))","v":""},{"$f":"IF(COUNTIF(nkl!$A$2:$Q$36,B7)=0,\"\",COUNTIF(nkl!$A$2:$Q$36,B7))","v":""},"-"]
[7,"geografia",{"$f":"IF(COUNTIF(ndst!$A$2:$Q$36,B8)=0,\"\",COUNTIF(ndst!$A$2:$Q$36,B8))","v":""},{"$f":"IF(COUNTIF(nkl!$A$2:$Q$36,B8)=0,\"\",COUNTIF(nkl!$A$2:$Q$36,B8))","v":""},"-"]
[8,"historia",{"$f":"IF(COUNTIF(ndst!$A$2:$Q$36,B9)=0,\"\",COUNTIF(ndst!$A$2:$Q$36,B9))","v":""},{"$f":"IF(COUNTIF(nkl!$A$2:$Q$36,B9)=0,\"\",COUNTIF(nkl!$A$2:$Q$36,B9))","v":""},"-"]
[9,"informatyka",{"$f":"IF(COUNTIF(ndst!$A$2:$Q$36,B10)=0,\"\",COUNTIF(ndst!$A$2:$Q$36,B10))","v":""},{"$f":"IF(COUNTIF(nkl!$A$2:$Q$36,B10)=0,\"\",COUNTIF(nkl!$A$2:$Q$36,B10))","v":""},"-"]
[10,"język francuski",{"$f":"IF(COUNTIF(ndst!$A$2:$Q$36,B11)=0,\"\",COUNTIF(ndst!$A$2:$Q$36,B11))","v":""},{"$f":"IF(COUNTIF(nkl!$A$2:$Q$36,B11)=0,\"\",COUNTIF(nkl!$A$2:$Q$36,B11))","v":""},"-"]
[11,"język francuski zawodowy",{"$f":"IF(COUNTIF(ndst!$A$2:$Q$36,B12)=0,\"\",COUNTIF(ndst!$A$2:$Q$36,B12))","v":""},{"$f":"IF(COUNTIF(nkl!$A$2:$Q$36,B12)=0,\"\",COUNTIF(nkl!$A$2:$Q$36,B12))","v":""},"-"]
[12,"język polski",{"$f":"IF(COUNTIF(ndst!$A$2:$Q$36,B13)=0,\"\",COUNTIF(ndst!$A$2:$Q$36,B13))","v":""},{"$f":"IF(COUNTIF(nkl!$A$2:$Q$36,B13)=0,\"\",COUNTIF(nkl!$A$2:$Q$36,B13))","v":""},"-"]
[13,"matematyka",{"$f":"IF(COUNTIF(ndst!$A$2:$Q$36,B14)=0,\"\",COUNTIF(ndst!$A$2:$Q$36,B14))","v":""},{"$f":"IF(COUNTIF(nkl!$A$2:$Q$36,B14)=0,\"\",COUNTIF(nkl!$A$2:$Q$36,B14))","v":""},"-"]
[14,"podstawy przedsiębiorczości",{"$f":"IF(COUNTIF(ndst!$A$2:$Q$36,B15)=0,\"\",COUNTIF(ndst!$A$2:$Q$36,B15))","v":""},{"$f":"IF(COUNTIF(nkl!$A$2:$Q$36,B15)=0,\"\",COUNTIF(nkl!$A$2:$Q$36,B15))","v":""},"-"]
[15,"podstawy żywienia",{"$f":"IF(COUNTIF(ndst!$A$2:$Q$36,B16)=0,\"\",COUNTIF(ndst!$A$2:$Q$36,B16))","v":""},{"$f":"IF(COUNTIF(nkl!$A$2:$Q$36,B16)=0,\"\",COUNTIF(nkl!$A$2:$Q$36,B16))","v":""},"-"]
[16,"pracownia gastronomiczna",{"$f":"IF(COUNTIF(ndst!$A$2:$Q$36,B17)=0,\"\",COUNTIF(ndst!$A$2:$Q$36,B17))","v":""},{"$f":"IF(COUNTIF(nkl!$A$2:$Q$36,B17)=0,\"\",COUNTIF(nkl!$A$2:$Q$36,B17))","v":""},"-"]
[17,"technika w gastronomii",{"$f":"IF(COUNTIF(ndst!$A$2:$Q$36,B18)=0,\"\",COUNTIF(ndst!$A$2:$Q$36,B18))","v":""},{"$f":"IF(COUNTIF(nkl!$A$2:$Q$36,B18)=0,\"\",COUNTIF(nkl!$A$2:$Q$36,B18))","v":""},"-"]
[18,"technologia gastronomiczna",{"$f":"IF(COUNTIF(ndst!$A$2:$Q$36,B19)=0,\"\",COUNTIF(ndst!$A$2:$Q$36,B19))","v":""},{"$f":"IF(COUNTIF(nkl!$A$2:$Q$36,B19)=0,\"\",COUNTIF(nkl!$A$2:$Q$36,B19))","v":""},"-"]
[19,"wiedza o społeczeństwie",{"$f":"IF(COUNTIF(ndst!$A$2:$Q$36,B20)=0,\"\",COUNTIF(ndst!$A$2:$Q$36,B20))","v":""},{"$f":"IF(COUNTIF(nkl!$A$2:$Q$36,B20)=0,\"\",COUNTIF(nkl!$A$2:$Q$36,B20))","v":""},"-"]
[20,"wychowanie fizyczne ",{"$f":"IF(COUNTIF(ndst!$A$2:$Q$36,B21)=0,\"\",COUNTIF(ndst!$A$2:$Q$36,B21))","v":""},{"$f":"IF(COUNTIF(nkl!$A$2:$Q$36,B21)=0,\"\",COUNTIF(nkl!$A$2:$Q$36,B21))","v":""},"-"]
[21,"zajęcia praktyczne",{"$f":"IF(COUNTIF(ndst!$A$2:$Q$36,B22)=0,\"\",COUNTIF(ndst!$A$2:$Q$36,B22))","v":""},{"$f":"IF(COUNTIF(nkl!$A$2:$Q$36,B22)=0,\"\",COUNTIF(nkl!$A$2:$Q$36,B22))","v":""},"-"]
[22,"religia",{"$f":"IF(COUNTIF(ndst!$A$2:$Q$36,B23)=0,\"\",COUNTIF(ndst!$A$2:$Q$36,B23))","v":""},{"$f":"IF(COUNTIF(nkl!$A$2:$Q$36,B23)=0,\"\",COUNTIF(nkl!$A$2:$Q$36,B23))","v":""},"-"]
[23,null,{"$f":"IF(COUNTIF(ndst!$A$2:$Q$36,B24)=0,\"\",COUNTIF(ndst!$A$2:$Q$36,B24))","v":""},{"$f":"IF(COUNTIF(nkl!$A$2:$Q$36,B24)=0,\"\",COUNTIF(nkl!$A$2:$Q$36,B24))","v":""},"-"]
[24,null,{"$f":"IF(COUNTIF(ndst!$A$2:$Q$36,B25)=0,\"\",COUNTIF(ndst!$A$2:$Q$36,B25))","v":""},{"$f":"IF(COUNTIF(nkl!$A$2:$Q$36,B25)=0,\"\",COUNTIF(nkl!$A$2:$Q$36,B25))","v":""},"-"]
[25,null,{"$f":"IF(COUNTIF(ndst!$A$2:$Q$36,B26)=0,\"\",COUNTIF(ndst!$A$2:$Q$36,B26))","v":""},{"$f":"IF(COUNTIF(nkl!$A$2:$Q$36,B26)=0,\"\",COUNTIF(nkl!$A$2:$Q$36,B26))","v":""},"-"]
[26,null,{"$f":"IF(COUNTIF(ndst!$A$2:$Q$36,B27)=0,\"\",COUNTIF(ndst!$A$2:$Q$36,B27))","v":""},{"$f":"IF(COUNTIF(nkl!$A$2:$Q$36,B27)=0,\"\",COUNTIF(nkl!$A$2:$Q$36,B27))","v":""},"-"]
[27,null,{"$f":"IF(COUNTIF(ndst!$A$2:$Q$36,B28)=0,\"\",COUNTIF(ndst!$A$2:$Q$36,B28))","v":""},{"$f":"IF(COUNTIF(nkl!$A$2:$Q$36,B28)=0,\"\",COUNTIF(nkl!$A$2:$Q$36,B28))","v":""},"-"]
[28,null,{"$f":"IF(COUNTIF(ndst!$A$2:$Q$36,B29)=0,\"\",COUNTIF(ndst!$A$2:$Q$36,B29))","v":""},{"$f":"IF(COUNTIF(nkl!$A$2:$Q$36,B29)=0,\"\",COUNTIF(nkl!$A$2:$Q$36,B29))","v":""},"-"]
[29,null,{"$f":"IF(COUNTIF(ndst!$A$2:$Q$36,B30)=0,\"\",COUNTIF(ndst!$A$2:$Q$36,B30))","v":""},{"$f":"IF(COUNTIF(nkl!$A$2:$Q$36,B30)=0,\"\",COUNTIF(nkl!$A$2:$Q$36,B30))","v":""},"-"]
[30,null,{"$f":"IF(COUNTIF(ndst!$A$2:$Q$36,B31)=0,\"\",COUNTIF(ndst!$A$2:$Q$36,B31))","v":""},{"$f":"IF(COUNTIF(nkl!$A$2:$Q$36,B31)=0,\"\",COUNTIF(nkl!$A$2:$Q$36,B31))","v":""},"-"]
[31,null,{"$f":"IF(COUNTIF(ndst!$A$2:$Q$36,B32)=0,\"\",COUNTIF(ndst!$A$2:$Q$36,B32))","v":""},{"$f":"IF(COUNTIF(nkl!$A$2:$Q$36,B32)=0,\"\",COUNTIF(nkl!$A$2:$Q$36,B32))","v":""},"-"]
[32,null,{"$f":"IF(COUNTIF(ndst!$A$2:$Q$36,B33)=0,\"\",COUNTIF(ndst!$A$2:$Q$36,B33))","v":""},{"$f":"IF(COUNTIF(nkl!$A$2:$Q$36,B33)=0,\"\",COUNTIF(nkl!$A$2:$Q$36,B33))","v":""},"-"]
[33,null,{"$f":"IF(COUNTIF(ndst!$A$2:$Q$36,B34)=0,\"\",COUNTIF(ndst!$A$2:$Q$36,B34))","v":""},{"$f":"IF(COUNTIF(nkl!$A$2:$Q$36,B34)=0,\"\",COUNTIF(nkl!$A$2:$Q$36,B34))","v":""},"-"]
[34,null,{"$f":"IF(COUNTIF(ndst!$A$2:$Q$36,B35)=0,\"\",COUNTIF(ndst!$A$2:$Q$36,B35))","v":""},{"$f":"IF(COUNTIF(nkl!$A$2:$Q$36,B35)=0,\"\",COUNTIF(nkl!$A$2:$Q$36,B35))","v":""},"-"]
[35,null,{"$f":"IF(COUNTIF(ndst!$A$2:$Q$36,B36)=0,\"\",COUNTIF(ndst!$A$2:$Q$36,B36))","v":""},{"$f":"IF(COUNTIF(nkl!$A$2:$Q$36,B36)=0,\"\",COUNTIF(nkl!$A$2:$Q$36,B36))","v":""},"-"]
[36,null,{"$f":"IF(COUNTIF(ndst!$A$2:$Q$36,B37)=0,\"\",COUNTIF(ndst!$A$2:$Q$36,B37))","v":""},{"$f":"IF(COUNTIF(nkl!$A$2:$Q$36,B37)=0,\"\",COUNTIF(nkl!$A$2:$Q$36,B37))","v":""},"-"]
[37,null,{"$f":"IF(COUNTIF(ndst!$A$2:$Q$36,B38)=0,\"\",COUNTIF(ndst!$A$2:$Q$36,B38))","v":""},{"$f":"IF(COUNTIF(nkl!$A$2:$Q$36,B38)=0,\"\",COUNTIF(nkl!$A$2:$Q$36,B38))","v":""},"-"]
[38,null,{"$f":"IF(COUNTIF(ndst!$A$2:$Q$36,B39)=0,\"\",COUNTIF(ndst!$A$2:$Q$36,B39))","v":""},{"$f":"IF(COUNTIF(nkl!$A$2:$Q$36,B39)=0,\"\",COUNTIF(nkl!$A$2:$Q$36,B39))","v":""},"-"]
[39,null,{"$f":"IF(COUNTIF(ndst!$A$2:$Q$36,B40)=0,\"\",COUNTIF(ndst!$A$2:$Q$36,B40))","v":""},{"$f":"IF(COUNTIF(nkl!$A$2:$Q$36,B40)=0,\"\",COUNTIF(nkl!$A$2:$Q$36,B40))","v":""},"-"]
[40,null,{"$f":"IF(COUNTIF(ndst!$A$2:$Q$36,B41)=0,\"\",COUNTIF(ndst!$A$2:$Q$36,B41))","v":""},{"$f":"IF(COUNTIF(nkl!$A$2:$Q$36,B41)=0,\"\",COUNTIF(nkl!$A$2:$Q$36,B41))","v":""},"-"]
[41,null,{"$f":"IF(COUNTIF(ndst!$A$2:$Q$36,B42)=0,\"\",COUNTIF(ndst!$A$2:$Q$36,B42))","v":""},{"$f":"IF(COUNTIF(nkl!$A$2:$Q$36,B42)=0,\"\",COUNTIF(nkl!$A$2:$Q$36,B42))","v":""},"-"]
[42,null,{"$f":"IF(COUNTIF(ndst!$A$2:$Q$36,B43)=0,\"\",COUNTIF(ndst!$A$2:$Q$36,B43))","v":""},{"$f":"IF(COUNTIF(nkl!$A$2:$Q$36,B43)=0,\"\",COUNTIF(nkl!$A$2:$Q$36,B43))","v":""},"-"]
[43,null,{"$f":"IF(COUNTIF(ndst!$A$2:$Q$36,B44)=0,\"\",COUNTIF(ndst!$A$2:$Q$36,B44))","v":""},{"$f":"IF(COUNTIF(nkl!$A$2:$Q$36,B44)=0,\"\",COUNTIF(nkl!$A$2:$Q$36,B44))","v":""},"-"]
[44,null,{"$f":"IF(COUNTIF(ndst!$A$2:$Q$36,B45)=0,\"\",COUNTIF(ndst!$A$2:$Q$36,B45))","v":""},{"$f":"IF(COUNTIF(nkl!$A$2:$Q$36,B45)=0,\"\",COUNTIF(nkl!$A$2:$Q$36,B45))","v":""},"-"]
[45,null,{"$f":"IF(COUNTIF(ndst!$A$2:$Q$36,B46)=0,\"\",COUNTIF(ndst!$A$2:$Q$36,B46))","v":""},{"$f":"IF(COUNTIF(nkl!$A$2:$Q$36,B46)=0,\"\",COUNTIF(nkl!$A$2:$Q$36,B46))","v":""},"-"]
[46,null,{"$f":"IF(COUNTIF(ndst!$A$2:$Q$36,B47)=0,\"\",COUNTIF(ndst!$A$2:$Q$36,B47))","v":""},{"$f":"IF(COUNTIF(nkl!$A$2:$Q$36,B47)=0,\"\",COUNTIF(nkl!$A$2:$Q$36,B47))","v":""},"-"]
[47,null,{"$f":"IF(COUNTIF(ndst!$A$2:$Q$36,B48)=0,\"\",COUNTIF(ndst!$A$2:$Q$36,B48))","v":""},{"$f":"IF(COUNTIF(nkl!$A$2:$Q$36,B48)=0,\"\",COUNTIF(nkl!$A$2:$Q$36,B48))","v":""},"-"]
[48,null,{"$f":"IF(COUNTIF(ndst!$A$2:$Q$36,B49)=0,\"\",COUNTIF(ndst!$A$2:$Q$36,B49))","v":""},{"$f":"IF(COUNTIF(nkl!$A$2:$Q$36,B49)=0,\"\",COUNTIF(nkl!$A$2:$Q$36,B49))","v":""},"-"]
[49,null,{"$f":"IF(COUNTIF(ndst!$A$2:$Q$36,B50)=0,\"\",COUNTIF(ndst!$A$2:$Q$36,B50))","v":""},{"$f":"IF(COUNTIF(nkl!$A$2:$Q$36,B50)=0,\"\",COUNTIF(nkl!$A$2:$Q$36,B50))","v":""},"-"]
[50,null,{"$f":"IF(COUNTIF(ndst!$A$2:$Q$36,B51)=0,\"\",COUNTIF(ndst!$A$2:$Q$36,B51))","v":""},{"$f":"IF(COUNTIF(nkl!$A$2:$Q$36,B51)=0,\"\",COUNTIF(nkl!$A$2:$Q$36,B51))","v":""},"-"]
[51,null,{"$f":"IF(COUNTIF(ndst!$A$2:$Q$36,B52)=0,\"\",COUNTIF(ndst!$A$2:$Q$36,B52))","v":""},{"$f":"IF(COUNTIF(nkl!$A$2:$Q$36,B52)=0,\"\",COUNTIF(nkl!$A$2:$Q$36,B52))","v":""},"-"]
[52,null,{"$f":"IF(COUNTIF(ndst!$A$2:$Q$36,B53)=0,\"\",COUNTIF(ndst!$A$2:$Q$36,B53))","v":""},{"$f":"IF(COUNTIF(nkl!$A$2:$Q$36,B53)=0,\"\",COUNTIF(nkl!$A$2:$Q$36,B53))","v":""},"-"]
[53,null,{"$f":"IF(COUNTIF(ndst!$A$2:$Q$36,B54)=0,\"\",COUNTIF(ndst!$A$2:$Q$36,B54))","v":""},{"$f":"IF(COUNTIF(nkl!$A$2:$Q$36,B54)=0,\"\",COUNTIF(nkl!$A$2:$Q$36,B54))","v":""},"-"]
[54,null,{"$f":"IF(COUNTIF(ndst!$A$2:$Q$36,B55)=0,\"\",COUNTIF(ndst!$A$2:$Q$36,B55))","v":""},{"$f":"IF(COUNTIF(nkl!$A$2:$Q$36,B55)=0,\"\",COUNTIF(nkl!$A$2:$Q$36,B55))","v":""},"-"]
[55,null,{"$f":"IF(COUNTIF(ndst!$A$2:$Q$36,B56)=0,\"\",COUNTIF(ndst!$A$2:$Q$36,B56))","v":""},{"$f":"IF(COUNTIF(nkl!$A$2:$Q$36,B56)=0,\"\",COUNTIF(nkl!$A$2:$Q$36,B56))","v":""},"-"]
[56,null,{"$f":"IF(COUNTIF(ndst!$A$2:$Q$36,B57)=0,\"\",COUNTIF(ndst!$A$2:$Q$36,B57))","v":""},{"$f":"IF(COUNTIF(nkl!$A$2:$Q$36,B57)=0,\"\",COUNTIF(nkl!$A$2:$Q$36,B57))","v":""},"-"]
[57,null,{"$f":"IF(COUNTIF(ndst!$A$2:$Q$36,B58)=0,\"\",COUNTIF(ndst!$A$2:$Q$36,B58))","v":""},{"$f":"IF(COUNTIF(nkl!$A$2:$Q$36,B58)=0,\"\",COUNTIF(nkl!$A$2:$Q$36,B58))","v":""},"-"]
[58,null,{"$f":"IF(COUNTIF(ndst!$A$2:$Q$36,B59)=0,\"\",COUNTIF(ndst!$A$2:$Q$36,B59))","v":""},{"$f":"IF(COUNTIF(nkl!$A$2:$Q$36,B59)=0,\"\",COUNTIF(nkl!$A$2:$Q$36,B59))","v":""},"-"]
[59,null,{"$f":"IF(COUNTIF(ndst!$A$2:$Q$36,B60)=0,\"\",COUNTIF(ndst!$A$2:$Q$36,B60))","v":""},{"$f":"IF(COUNTIF(nkl!$A$2:$Q$36,B60)=0,\"\",COUNTIF(nkl!$A$2:$Q$36,B60))","v":""},"-"]
[60,null,{"$f":"IF(COUNTIF(ndst!$A$2:$Q$36,B61)=0,\"\",COUNTIF(ndst!$A$2:$Q$36,B61))","v":""},{"$f":"IF(COUNTIF(nkl!$A$2:$Q$36,B61)=0,\"\",COUNTIF(nkl!$A$2:$Q$36,B61))","v":""},"-"]
[61,null,{"$f":"IF(COUNTIF(ndst!$A$2:$Q$36,B62)=0,\"\",COUNTIF(ndst!$A$2:$Q$36,B62))","v":""},{"$f":"IF(COUNTIF(nkl!$A$2:$Q$36,B62)=0,\"\",COUNTIF(nkl!$A$2:$Q$36,B62))","v":""},"-"]
[62,null,{"$f":"IF(COUNTIF(ndst!$A$2:$Q$36,B63)=0,\"\",COUNTIF(ndst!$A$2:$Q$36,B63))","v":""},{"$f":"IF(COUNTIF(nkl!$A$2:$Q$36,B63)=0,\"\",COUNTIF(nkl!$A$2:$Q$36,B63))","v":""},"-"]
[63,null,{"$f":"IF(COUNTIF(ndst!$A$2:$Q$36,B64)=0,\"\",COUNTIF(ndst!$A$2:$Q$36,B64))","v":""},{"$f":"IF(COUNTIF(nkl!$A$2:$Q$36,B64)=0,\"\",COUNTIF(nkl!$A$2:$Q$36,B64))","v":""},"-"]
[64,null,{"$f":"IF(COUNTIF(ndst!$A$2:$Q$36,B65)=0,\"\",COUNTIF(ndst!$A$2:$Q$36,B65))","v":""},{"$f":"IF(COUNTIF(nkl!$A$2:$Q$36,B65)=0,\"\",COUNTIF(nkl!$A$2:$Q$36,B65))","v":""},"-"]
[65,null,{"$f":"IF(COUNTIF(ndst!$A$2:$Q$36,B66)=0,\"\",COUNTIF(ndst!$A$2:$Q$36,B66))","v":""},{"$f":"IF(COUNTIF(nkl!$A$2:$Q$36,B66)=0,\"\",COUNTIF(nkl!$A$2:$Q$36,B66))","v":""},"-"]
[66,null,{"$f":"IF(COUNTIF(ndst!$A$2:$Q$36,B67)=0,\"\",COUNTIF(ndst!$A$2:$Q$36,B67))","v":""},{"$f":"IF(COUNTIF(nkl!$A$2:$Q$36,B67)=0,\"\",COUNTIF(nkl!$A$2:$Q$36,B67))","v":""},{"$f":"IF(C67&D67<>\"\",\"tak\",\"-\")","v":"-"}]
[67,null,{"$f":"IF(COUNTIF(ndst!$A$2:$Q$36,B68)=0,\"\",COUNTIF(ndst!$A$2:$Q$36,B68))","v":""},{"$f":"IF(COUNTIF(nkl!$A$2:$Q$36,B68)=0,\"\",COUNTIF(nkl!$A$2:$Q$36,B68))","v":""},"-"]
[68,null,{"$f":"IF(COUNTIF(ndst!$A$2:$Q$36,B69)=0,\"\",COUNTIF(ndst!$A$2:$Q$36,B69))","v":""},{"$f":"IF(COUNTIF(nkl!$A$2:$Q$36,B69)=0,\"\",COUNTIF(nkl!$A$2:$Q$36,B69))","v":""},"-"]
[69,null,{"$f":"IF(COUNTIF(ndst!$A$2:$Q$36,B70)=0,\"\",COUNTIF(ndst!$A$2:$Q$36,B70))","v":""},{"$f":"IF(COUNTIF(nkl!$A$2:$Q$36,B70)=0,\"\",COUNTIF(nkl!$A$2:$Q$36,B70))","v":""},"-"]
[70,null,{"$f":"IF(COUNTIF(ndst!$A$2:$Q$36,B71)=0,\"\",COUNTIF(ndst!$A$2:$Q$36,B71))","v":""},{"$f":"IF(COUNTIF(nkl!$A$2:$Q$36,B71)=0,\"\",COUNTIF(nkl!$A$2:$Q$36,B71))","v":""},"-"]
[71,null,{"$f":"IF(COUNTIF(ndst!$A$2:$Q$36,B72)=0,\"\",COUNTIF(ndst!$A$2:$Q$36,B72))","v":""},{"$f":"IF(COUNTIF(nkl!$A$2:$Q$36,B72)=0,\"\",COUNTIF(nkl!$A$2:$Q$36,B72))","v":""},"-"]
[72,null,{"$f":"IF(COUNTIF(ndst!$A$2:$Q$36,B73)=0,\"\",COUNTIF(ndst!$A$2:$Q$36,B73))","v":""},{"$f":"IF(COUNTIF(nkl!$A$2:$Q$36,B73)=0,\"\",COUNTIF(nkl!$A$2:$Q$36,B73))","v":""},"-"]
[73,null,{"$f":"IF(COUNTIF(ndst!$A$2:$Q$36,B74)=0,\"\",COUNTIF(ndst!$A$2:$Q$36,B74))","v":""},{"$f":"IF(COUNTIF(nkl!$A$2:$Q$36,B74)=0,\"\",COUNTIF(nkl!$A$2:$Q$36,B74))","v":""},"-"]
[74,null,{"$f":"IF(COUNTIF(ndst!$A$2:$Q$36,B75)=0,\"\",COUNTIF(ndst!$A$2:$Q$36,B75))","v":""},{"$f":"IF(COUNTIF(nkl!$A$2:$Q$36,B75)=0,\"\",COUNTIF(nkl!$A$2:$Q$36,B75))","v":""},"-"]
[75,null,{"$f":"IF(COUNTIF(ndst!$A$2:$Q$36,B76)=0,\"\",COUNTIF(ndst!$A$2:$Q$36,B76))","v":""},{"$f":"IF(COUNTIF(nkl!$A$2:$Q$36,B76)=0,\"\",COUNTIF(nkl!$A$2:$Q$36,B76))","v":""},"-"]
[76,null,{"$f":"IF(COUNTIF(ndst!$A$2:$Q$36,B77)=0,\"\",COUNTIF(ndst!$A$2:$Q$36,B77))","v":""},{"$f":"IF(COUNTIF(nkl!$A$2:$Q$36,B77)=0,\"\",COUNTIF(nkl!$A$2:$Q$36,B77))","v":""},"-"]
[77,null,{"$f":"IF(COUNTIF(ndst!$A$2:$Q$36,B78)=0,\"\",COUNTIF(ndst!$A$2:$Q$36,B78))","v":""},{"$f":"IF(COUNTIF(nkl!$A$2:$Q$36,B78)=0,\"\",COUNTIF(nkl!$A$2:$Q$36,B78))","v":""},"-"]
[78,null,{"$f":"IF(COUNTIF(ndst!$A$2:$Q$36,B79)=0,\"\",COUNTIF(ndst!$A$2:$Q$36,B79))","v":""},{"$f":"IF(COUNTIF(nkl!$A$2:$Q$36,B79)=0,\"\",COUNTIF(nkl!$A$2:$Q$36,B79))","v":""},"-"]
[79,null,{"$f":"IF(COUNTIF(ndst!$A$2:$Q$36,B80)=0,\"\",COUNTIF(ndst!$A$2:$Q$36,B80))","v":""},{"$f":"IF(COUNTIF(nkl!$A$2:$Q$36,B80)=0,\"\",COUNTIF(nkl!$A$2:$Q$36,B80))","v":""},"-"]
[80,null,{"$f":"IF(COUNTIF(ndst!$A$2:$Q$36,B81)=0,\"\",COUNTIF(ndst!$A$2:$Q$36,B81))","v":""},{"$f":"IF(COUNTIF(nkl!$A$2:$Q$36,B81)=0,\"\",COUNTIF(nkl!$A$2:$Q$36,B81))","v":""},"-"]
[81,null,{"$f":"IF(COUNTIF(ndst!$A$2:$Q$36,B82)=0,\"\",COUNTIF(ndst!$A$2:$Q$36,B82))","v":""},{"$f":"IF(COUNTIF(nkl!$A$2:$Q$36,B82)=0,\"\",COUNTIF(nkl!$A$2:$Q$36,B82))","v":""},"-"]
[82,null,{"$f":"IF(COUNTIF(ndst!$A$2:$Q$36,B83)=0,\"\",COUNTIF(ndst!$A$2:$Q$36,B83))","v":""},{"$f":"IF(COUNTIF(nkl!$A$2:$Q$36,B83)=0,\"\",COUNTIF(nkl!$A$2:$Q$36,B83))","v":""},"-"]
[83,null,{"$f":"IF(COUNTIF(ndst!$A$2:$Q$36,B84)=0,\"\",COUNTIF(ndst!$A$2:$Q$36,B84))","v":""},{"$f":"IF(COUNTIF(nkl!$A$2:$Q$36,B84)=0,\"\",COUNTIF(nkl!$A$2:$Q$36,B84))","v":""},"-"]
[84,null,{"$f":"IF(COUNTIF(ndst!$A$2:$Q$36,B85)=0,\"\",COUNTIF(ndst!$A$2:$Q$36,B85))","v":""},{"$f":"IF(COUNTIF(nkl!$A$2:$Q$36,B85)=0,\"\",COUNTIF(nkl!$A$2:$Q$36,B85))","v":""},"-"]
[85,null,{"$f":"IF(COUNTIF(ndst!$A$2:$Q$36,B86)=0,\"\",COUNTIF(ndst!$A$2:$Q$36,B86))","v":""},{"$f":"IF(COUNTIF(nkl!$A$2:$Q$36,B86)=0,\"\",COUNTIF(nkl!$A$2:$Q$36,B86))","v":""},"-"]
[86,null,{"$f":"IF(COUNTIF(ndst!$A$2:$Q$36,B87)=0,\"\",COUNTIF(ndst!$A$2:$Q$36,B87))","v":""},{"$f":"IF(COUNTIF(nkl!$A$2:$Q$36,B87)=0,\"\",COUNTIF(nkl!$A$2:$Q$36,B87))","v":""},"-"]
[87,null,{"$f":"IF(COUNTIF(ndst!$A$2:$Q$36,B88)=0,\"\",COUNTIF(ndst!$A$2:$Q$36,B88))","v":""},{"$f":"IF(COUNTIF(nkl!$A$2:$Q$36,B88)=0,\"\",COUNTIF(nkl!$A$2:$Q$36,B88))","v":""},"-"]
[88,null,{"$f":"IF(COUNTIF(ndst!$A$2:$Q$36,B89)=0,\"\",COUNTIF(ndst!$A$2:$Q$36,B89))","v":""},{"$f":"IF(COUNTIF(nkl!$A$2:$Q$36,B89)=0,\"\",COUNTIF(nkl!$A$2:$Q$36,B89))","v":""},"-"]
[89,null,{"$f":"IF(COUNTIF(ndst!$A$2:$Q$36,B90)=0,\"\",COUNTIF(ndst!$A$2:$Q$36,B90))","v":""},{"$f":"IF(COUNTIF(nkl!$A$2:$Q$36,B90)=0,\"\",COUNTIF(nkl!$A$2:$Q$36,B90))","v":""},"-"]
[90,null,{"$f":"IF(COUNTIF(ndst!$A$2:$Q$36,B91)=0,\"\",COUNTIF(ndst!$A$2:$Q$36,B91))","v":""},{"$f":"IF(COUNTIF(nkl!$A$2:$Q$36,B91)=0,\"\",COUNTIF(nkl!$A$2:$Q$36,B91))","v":""},"-"]
[91,null,{"$f":"IF(COUNTIF(ndst!$A$2:$Q$36,B92)=0,\"\",COUNTIF(ndst!$A$2:$Q$36,B92))","v":""},{"$f":"IF(COUNTIF(nkl!$A$2:$Q$36,B92)=0,\"\",COUNTIF(nkl!$A$2:$Q$36,B92))","v":""},"-"]
[92,null,{"$f":"IF(COUNTIF(ndst!$A$2:$Q$36,B93)=0,\"\",COUNTIF(ndst!$A$2:$Q$36,B93))","v":""},{"$f":"IF(COUNTIF(nkl!$A$2:$Q$36,B93)=0,\"\",COUNTIF(nkl!$A$2:$Q$36,B93))","v":""},"-"]
[93,null,{"$f":"IF(COUNTIF(ndst!$A$2:$Q$36,B94)=0,\"\",COUNTIF(ndst!$A$2:$Q$36,B94))","v":""},{"$f":"IF(COUNTIF(nkl!$A$2:$Q$36,B94)=0,\"\",COUNTIF(nkl!$A$2:$Q$36,B94))","v":""},"-"]
[94,null,{"$f":"IF(COUNTIF(ndst!$A$2:$Q$36,B95)=0,\"\",COUNTIF(ndst!$A$2:$Q$36,B95))","v":""},{"$f":"IF(COUNTIF(nkl!$A$2:$Q$36,B95)=0,\"\",COUNTIF(nkl!$A$2:$Q$36,B95))","v":""},"-"]
[95,null,{"$f":"IF(COUNTIF(ndst!$A$2:$Q$36,B96)=0,\"\",COUNTIF(ndst!$A$2:$Q$36,B96))","v":""},{"$f":"IF(COUNTIF(nkl!$A$2:$Q$36,B96)=0,\"\",COUNTIF(nkl!$A$2:$Q$36,B96))","v":""},"-"]
[96,null,{"$f":"IF(COUNTIF(ndst!$A$2:$Q$36,B97)=0,\"\",COUNTIF(ndst!$A$2:$Q$36,B97))","v":""},{"$f":"IF(COUNTIF(nkl!$A$2:$Q$36,B97)=0,\"\",COUNTIF(nkl!$A$2:$Q$36,B97))","v":""},"-"]
[97,null,{"$f":"IF(COUNTIF(ndst!$A$2:$Q$36,B98)=0,\"\",COUNTIF(ndst!$A$2:$Q$36,B98))","v":""},{"$f":"IF(COUNTIF(nkl!$A$2:$Q$36,B98)=0,\"\",COUNTIF(nkl!$A$2:$Q$36,B98))","v":""},"-"]
[98,null,{"$f":"IF(COUNTIF(ndst!$A$2:$Q$36,B99)=0,\"\",COUNTIF(ndst!$A$2:$Q$36,B99))","v":""},{"$f":"IF(COUNTIF(nkl!$A$2:$Q$36,B99)=0,\"\",COUNTIF(nkl!$A$2:$Q$36,B99))","v":""},"-"]
[99,null,{"$f":"IF(COUNTIF(ndst!$A$2:$Q$36,B100)=0,\"\",COUNTIF(ndst!$A$2:$Q$36,B100))","v":""},{"$f":"IF(COUNTIF(nkl!$A$2:$Q$36,B100)=0,\"\",COUNTIF(nkl!$A$2:$Q$36,B100))","v":""},"-"]
[100,null,{"$f":"IF(COUNTIF(ndst!$A$2:$Q$36,B101)=0,\"\",COUNTIF(ndst!$A$2:$Q$36,B101))","v":""},{"$f":"IF(COUNTIF(nkl!$A$2:$Q$36,B101)=0,\"\",COUNTIF(nkl!$A$2:$Q$36,B101))","v":""},"-"]
[101,null,{"$f":"IF(COUNTIF(ndst!$A$2:$Q$36,B102)=0,\"\",COUNTIF(ndst!$A$2:$Q$36,B102))","v":""},{"$f":"IF(COUNTIF(nkl!$A$2:$Q$36,B102)=0,\"\",COUNTIF(nkl!$A$2:$Q$36,B102))","v":""},"-"]
[102,null,{"$f":"IF(COUNTIF(ndst!$A$2:$Q$36,B103)=0,\"\",COUNTIF(ndst!$A$2:$Q$36,B103))","v":""},{"$f":"IF(COUNTIF(nkl!$A$2:$Q$36,B103)=0,\"\",COUNTIF(nkl!$A$2:$Q$36,B103))","v":""},"-"]
[103,null,{"$f":"IF(COUNTIF(ndst!$A$2:$Q$36,B104)=0,\"\",COUNTIF(ndst!$A$2:$Q$36,B104))","v":""},{"$f":"IF(COUNTIF(nkl!$A$2:$Q$36,B104)=0,\"\",COUNTIF(nkl!$A$2:$Q$36,B104))","v":""},"-",null,null,null,null,null,null,null,null,null,null,null,null,null,null,null,null,null,null,null,null,null,null,"biologia"]
[104,null,{"$f":"IF(COUNTIF(ndst!$A$2:$Q$36,B105)=0,\"\",COUNTIF(ndst!$A$2:$Q$36,B105))","v":""},{"$f":"IF(COUNTIF(nkl!$A$2:$Q$36,B105)=0,\"\",COUNTIF(nkl!$A$2:$Q$36,B105))","v":""},"-"]
[105,null,{"$f":"IF(COUNTIF(ndst!$A$2:$Q$36,B106)=0,\"\",COUNTIF(ndst!$A$2:$Q$36,B106))","v":""},{"$f":"IF(COUNTIF(nkl!$A$2:$Q$36,B106)=0,\"\",COUNTIF(nkl!$A$2:$Q$36,B106))","v":""},"-",null,null,null,null,null,null,null,null,null,null,null,null,null,null,null,null,null,null,null,null,null,null,"chemia"]
[106,null,{"$f":"IF(COUNTIF(ndst!$A$2:$Q$36,B107)=0,\"\",COUNTIF(ndst!$A$2:$Q$36,B107))","v":""},{"$f":"IF(COUNTIF(nkl!$A$2:$Q$36,B107)=0,\"\",COUNTIF(nkl!$A$2:$Q$36,B107))","v":""},"-"]
[107,null,{"$f":"IF(COUNTIF(ndst!$A$2:$Q$36,B108)=0,\"\",COUNTIF(ndst!$A$2:$Q$36,B108))","v":""},{"$f":"IF(COUNTIF(nkl!$A$2:$Q$36,B108)=0,\"\",COUNTIF(nkl!$A$2:$Q$36,B108))","v":""},"-"]
[108,null,{"$f":"IF(COUNTIF(ndst!$A$2:$Q$36,B109)=0,\"\",COUNTIF(ndst!$A$2:$Q$36,B109))","v":""},{"$f":"IF(COUNTIF(nkl!$A$2:$Q$36,B109)=0,\"\",COUNTIF(nkl!$A$2:$Q$36,B109))","v":""},"-",null,null,null,null,null,null,null,null,null,null,null,null,null,null,null,null,null,null,null,null,null,null,"religia/etyka"]
[109,null,{"$f":"IF(COUNTIF(ndst!$A$2:$Q$36,B110)=0,\"\",COUNTIF(ndst!$A$2:$Q$36,B110))","v":""},{"$f":"IF(COUNTIF(nkl!$A$2:$Q$36,B110)=0,\"\",COUNTIF(nkl!$A$2:$Q$36,B110))","v":""},"-",null,null,null,null,null,null,null,null,null,null,null,null,null,null,null,null,null,null,null,null,null,null,"edukacja dla bezpieczeństwa"]
[110,null,{"$f":"IF(COUNTIF(ndst!$A$2:$Q$36,B111)=0,\"\",COUNTIF(ndst!$A$2:$Q$36,B111))","v":""},{"$f":"IF(COUNTIF(nkl!$A$2:$Q$36,B111)=0,\"\",COUNTIF(nkl!$A$2:$Q$36,B111))","v":""},"-",null,null,null,null,null,null,null,null,null,null,null,null,null,null,null,null,null,null,null,null,null,null,"fizyka"]
[111,null,{"$f":"IF(COUNTIF(ndst!$A$2:$Q$36,B112)=0,\"\",COUNTIF(ndst!$A$2:$Q$36,B112))","v":""},{"$f":"IF(COUNTIF(nkl!$A$2:$Q$36,B112)=0,\"\",COUNTIF(nkl!$A$2:$Q$36,B112))","v":""},"-",null,null,null,null,null,null,null,null,null,null,null,null,null,null,null,null,null,null,null,null,null,null,"geografia"]
[112,null,{"$f":"IF(COUNTIF(ndst!$A$2:$Q$36,B113)=0,\"\",COUNTIF(ndst!$A$2:$Q$36,B113))","v":""},{"$f":"IF(COUNTIF(nkl!$A$2:$Q$36,B113)=0,\"\",COUNTIF(nkl!$A$2:$Q$36,B113))","v":""},"-",null,null,null,null,null,null,null,null,null,null,null,null,null,null,null,null,null,null,null,null,null,null,"historia"]
[113,null,{"$f":"IF(COUNTIF(ndst!$A$2:$Q$36,B114)=0,\"\",COUNTIF(ndst!$A$2:$Q$36,B114))","v":""},{"$f":"IF(COUNTIF(nkl!$A$2:$Q$36,B114)=0,\"\",COUNTIF(nkl!$A$2:$Q$36,B114))","v":""},"-",null,null,null,null,null,null,null,null,null,null,null,null,null,null,null,null,null,null,null,null,null,null,"historia i społeczeństwo"]
[114,null,{"$f":"IF(COUNTIF(ndst!$A$2:$Q$36,B115)=0,\"\",COUNTIF(ndst!$A$2:$Q$36,B115))","v":""},{"$f":"IF(COUNTIF(nkl!$A$2:$Q$36,B115)=0,\"\",COUNTIF(nkl!$A$2:$Q$36,B115))","v":""},"-",null,null,null,null,null,null,null,null,null,null,null,null,null,null,null,null,null,null,null,null,null,null,"informatyka"]
[115,null,{"$f":"IF(COUNTIF(ndst!$A$2:$Q$36,B116)=0,\"\",COUNTIF(ndst!$A$2:$Q$36,B116))","v":""},{"$f":"IF(COUNTIF(nkl!$A$2:$Q$36,B116)=0,\"\",COUNTIF(nkl!$A$2:$Q$36,B116))","v":""},"-",null,null,null,null,null,null,null,null,null,null,null,null,null,null,null,null,null,null,null,null,null,null,"język angielski"]
[116,null,{"$f":"IF(COUNTIF(ndst!$A$2:$Q$36,B117)=0,\"\",COUNTIF(ndst!$A$2:$Q$36,B117))","v":""},{"$f":"IF(COUNTIF(nkl!$A$2:$Q$36,B117)=0,\"\",COUNTIF(nkl!$A$2:$Q$36,B117))","v":""},"-",null,null,null,null,null,null,null,null,null,null,null,null,null,null,null,null,null,null,null,null,null,null,"język francuski"]
[117,null,{"$f":"IF(COUNTIF(ndst!$A$2:$Q$36,B118)=0,\"\",COUNTIF(ndst!$A$2:$Q$36,B118))","v":""},{"$f":"IF(COUNTIF(nkl!$A$2:$Q$36,B118)=0,\"\",COUNTIF(nkl!$A$2:$Q$36,B118))","v":""},"-",null,null,null,null,null,null,null,null,null,null,null,null,null,null,null,null,null,null,null,null,null,null,"język niemiecki"]
[118,null,{"$f":"IF(COUNTIF(ndst!$A$2:$Q$36,B119)=0,\"\",COUNTIF(ndst!$A$2:$Q$36,B119))","v":""},{"$f":"IF(COUNTIF(nkl!$A$2:$Q$36,B119)=0,\"\",COUNTIF(nkl!$A$2:$Q$36,B119))","v":""},"-",null,null,null,null,null,null,null,null,null,null,null,null,null,null,null,null,null,null,null,null,null,null,"język polski"]
[119,null,{"$f":"IF(COUNTIF(ndst!$A$2:$Q$36,B120)=0,\"\",COUNTIF(ndst!$A$2:$Q$36,B120))","v":""},{"$f":"IF(COUNTIF(nkl!$A$2:$Q$36,B120)=0,\"\",COUNTIF(nkl!$A$2:$Q$36,B120))","v":""},"-",null,null,null,null,null,null,null,null,null,null,null,null,null,null,null,null,null,null,null,null,null,null,"język rosyjski"]
[120,null,{"$f":"IF(COUNTIF(ndst!$A$2:$Q$36,B121)=0,\"\",COUNTIF(ndst!$A$2:$Q$36,B121))","v":""},{"$f":"IF(COUNTIF(nkl!$A$2:$Q$36,B121)=0,\"\",COUNTIF(nkl!$A$2:$Q$36,B121))","v":""},"-",null,null,null,null,null,null,null,null,null,null,null,null,null,null,null,null,null,null,null,null,null,null,"komunikacja medialna"]
[121,null,{"$f":"IF(COUNTIF(ndst!$A$2:$Q$36,B122)=0,\"\",COUNTIF(ndst!$A$2:$Q$36,B122))","v":""},{"$f":"IF(COUNTIF(nkl!$A$2:$Q$36,B122)=0,\"\",COUNTIF(nkl!$A$2:$Q$36,B122))","v":""},"-",null,null,null,null,null,null,null,null,null,null,null,null,null,null,null,null,null,null,null,null,null,null,"matematyka"]
[122,null,{"$f":"IF(COUNTIF(ndst!$A$2:$Q$36,B123)=0,\"\",COUNTIF(ndst!$A$2:$Q$36,B123))","v":""},{"$f":"IF(COUNTIF(nkl!$A$2:$Q$36,B123)=0,\"\",COUNTIF(nkl!$A$2:$Q$36,B123))","v":""},"-",null,null,null,null,null,null,null,null,null,null,null,null,null,null,null,null,null,null,null,null,null,null,"przyroda"]
[123,null,{"$f":"IF(COUNTIF(ndst!$A$2:$Q$36,B124)=0,\"\",COUNTIF(ndst!$A$2:$Q$36,B124))","v":""},{"$f":"IF(COUNTIF(nkl!$A$2:$Q$36,B124)=0,\"\",COUNTIF(nkl!$A$2:$Q$36,B124))","v":""},"-",null,null,null,null,null,null,null,null,null,null,null,null,null,null,null,null,null,null,null,null,null,null,"wiedza o kulturze"]
[124,null,{"$f":"IF(COUNTIF(ndst!$A$2:$Q$36,B125)=0,\"\",COUNTIF(ndst!$A$2:$Q$36,B125))","v":""},{"$f":"IF(COUNTIF(nkl!$A$2:$Q$36,B125)=0,\"\",COUNTIF(nkl!$A$2:$Q$36,B125))","v":""},"-",null,null,null,null,null,null,null,null,null,null,null,null,null,null,null,null,null,null,null,null,null,null,"wiedza o społeczeństwie"]
[125,null,{"$f":"IF(COUNTIF(ndst!$A$2:$Q$36,B126)=0,\"\",COUNTIF(ndst!$A$2:$Q$36,B126))","v":""},{"$f":"IF(COUNTIF(nkl!$A$2:$Q$36,B126)=0,\"\",COUNTIF(nkl!$A$2:$Q$36,B126))","v":""},"-",null,null,null,null,null,null,null,null,null,null,null,null,null,null,null,null,null,null,null,null,null,null,"wychowanie fizyczne"]
[126,null,{"$f":"IF(COUNTIF(ndst!$A$2:$Q$36,B127)=0,\"\",COUNTIF(ndst!$A$2:$Q$36,B127))","v":""},{"$f":"IF(COUNTIF(nkl!$A$2:$Q$36,B127)=0,\"\",COUNTIF(nkl!$A$2:$Q$36,B127))","v":""},"-"]
[127,null,{"$f":"IF(COUNTIF(ndst!$A$2:$Q$36,B128)=0,\"\",COUNTIF(ndst!$A$2:$Q$36,B128))","v":""},{"$f":"IF(COUNTIF(nkl!$A$2:$Q$36,B128)=0,\"\",COUNTIF(nkl!$A$2:$Q$36,B128))","v":""},"-"]
[128,null,{"$f":"IF(COUNTIF(ndst!$A$2:$Q$36,B129)=0,\"\",COUNTIF(ndst!$A$2:$Q$36,B129))","v":""},{"$f":"IF(COUNTIF(nkl!$A$2:$Q$36,B129)=0,\"\",COUNTIF(nkl!$A$2:$Q$36,B129))","v":""},"-"]
[129,null,{"$f":"IF(COUNTIF(ndst!$A$2:$Q$36,B130)=0,\"\",COUNTIF(ndst!$A$2:$Q$36,B130))","v":""},{"$f":"IF(COUNTIF(nkl!$A$2:$Q$36,B130)=0,\"\",COUNTIF(nkl!$A$2:$Q$36,B130))","v":""},"-"]
[130,null,{"$f":"IF(COUNTIF(ndst!$A$2:$Q$36,B131)=0,\"\",COUNTIF(ndst!$A$2:$Q$36,B131))","v":""},{"$f":"IF(COUNTIF(nkl!$A$2:$Q$36,B131)=0,\"\",COUNTIF(nkl!$A$2:$Q$36,B131))","v":""},{"$f":"IF(C131&D131<>\"\",\"tak\",\"-\")","v":"-"}]
[131,null,{"$f":"IF(COUNTIF(ndst!$A$2:$Q$36,B132)=0,\"\",COUNTIF(ndst!$A$2:$Q$36,B132))","v":""},{"$f":"IF(COUNTIF(nkl!$A$2:$Q$36,B132)=0,\"\",COUNTIF(nkl!$A$2:$Q$36,B132))","v":""},"-"]
[132,null,{"$f":"IF(COUNTIF(ndst!$A$2:$Q$36,B133)=0,\"\",COUNTIF(ndst!$A$2:$Q$36,B133))","v":""},{"$f":"IF(COUNTIF(nkl!$A$2:$Q$36,B133)=0,\"\",COUNTIF(nkl!$A$2:$Q$36,B133))","v":""},"-"]
[133,null,{"$f":"IF(COUNTIF(ndst!$A$2:$Q$36,B134)=0,\"\",COUNTIF(ndst!$A$2:$Q$36,B134))","v":""},{"$f":"IF(COUNTIF(nkl!$A$2:$Q$36,B134)=0,\"\",COUNTIF(nkl!$A$2:$Q$36,B134))","v":""},"-"]
[134,null,{"$f":"IF(COUNTIF(ndst!$A$2:$Q$36,B135)=0,\"\",COUNTIF(ndst!$A$2:$Q$36,B135))","v":""},{"$f":"IF(COUNTIF(nkl!$A$2:$Q$36,B135)=0,\"\",COUNTIF(nkl!$A$2:$Q$36,B135))","v":""},"-"]
[135,null,{"$f":"IF(COUNTIF(ndst!$A$2:$Q$36,B136)=0,\"\",COUNTIF(ndst!$A$2:$Q$36,B136))","v":""},{"$f":"IF(COUNTIF(nkl!$A$2:$Q$36,B136)=0,\"\",COUNTIF(nkl!$A$2:$Q$36,B136))","v":""},"-"]
[136,null,{"$f":"IF(COUNTIF(ndst!$A$2:$Q$36,B137)=0,\"\",COUNTIF(ndst!$A$2:$Q$36,B137))","v":""},{"$f":"IF(COUNTIF(nkl!$A$2:$Q$36,B137)=0,\"\",COUNTIF(nkl!$A$2:$Q$36,B137))","v":""},"-"]
[137,null,{"$f":"IF(COUNTIF(ndst!$A$2:$Q$36,B138)=0,\"\",COUNTIF(ndst!$A$2:$Q$36,B138))","v":""},{"$f":"IF(COUNTIF(nkl!$A$2:$Q$36,B138)=0,\"\",COUNTIF(nkl!$A$2:$Q$36,B138))","v":""},"-"]
[138,null,{"$f":"IF(COUNTIF(ndst!$A$2:$Q$36,B139)=0,\"\",COUNTIF(ndst!$A$2:$Q$36,B139))","v":""},{"$f":"IF(COUNTIF(nkl!$A$2:$Q$36,B139)=0,\"\",COUNTIF(nkl!$A$2:$Q$36,B139))","v":""},"-"]
[139,null,{"$f":"IF(COUNTIF(ndst!$A$2:$Q$36,B140)=0,\"\",COUNTIF(ndst!$A$2:$Q$36,B140))","v":""},{"$f":"IF(COUNTIF(nkl!$A$2:$Q$36,B140)=0,\"\",COUNTIF(nkl!$A$2:$Q$36,B140))","v":""},"-"]
[140,null,{"$f":"IF(COUNTIF(ndst!$A$2:$Q$36,B141)=0,\"\",COUNTIF(ndst!$A$2:$Q$36,B141))","v":""},{"$f":"IF(COUNTIF(nkl!$A$2:$Q$36,B141)=0,\"\",COUNTIF(nkl!$A$2:$Q$36,B141))","v":""},"-"]
[141,null,{"$f":"IF(COUNTIF(ndst!$A$2:$Q$36,B142)=0,\"\",COUNTIF(ndst!$A$2:$Q$36,B142))","v":""},{"$f":"IF(COUNTIF(nkl!$A$2:$Q$36,B142)=0,\"\",COUNTIF(nkl!$A$2:$Q$36,B142))","v":""},"-"]
[142,null,{"$f":"IF(COUNTIF(ndst!$A$2:$Q$36,B143)=0,\"\",COUNTIF(ndst!$A$2:$Q$36,B143))","v":""},{"$f":"IF(COUNTIF(nkl!$A$2:$Q$36,B143)=0,\"\",COUNTIF(nkl!$A$2:$Q$36,B143))","v":""},"-"]
[143,null,{"$f":"IF(COUNTIF(ndst!$A$2:$Q$36,B144)=0,\"\",COUNTIF(ndst!$A$2:$Q$36,B144))","v":""},{"$f":"IF(COUNTIF(nkl!$A$2:$Q$36,B144)=0,\"\",COUNTIF(nkl!$A$2:$Q$36,B144))","v":""},"-"]
[144,null,{"$f":"IF(COUNTIF(ndst!$A$2:$Q$36,B145)=0,\"\",COUNTIF(ndst!$A$2:$Q$36,B145))","v":""},{"$f":"IF(COUNTIF(nkl!$A$2:$Q$36,B145)=0,\"\",COUNTIF(nkl!$A$2:$Q$36,B145))","v":""},"-"]
[145,null,{"$f":"IF(COUNTIF(ndst!$A$2:$Q$36,B146)=0,\"\",COUNTIF(ndst!$A$2:$Q$36,B146))","v":""},{"$f":"IF(COUNTIF(nkl!$A$2:$Q$36,B146)=0,\"\",COUNTIF(nkl!$A$2:$Q$36,B146))","v":""},"-"]
[146,null,{"$f":"IF(COUNTIF(ndst!$A$2:$Q$36,B147)=0,\"\",COUNTIF(ndst!$A$2:$Q$36,B147))","v":""},{"$f":"IF(COUNTIF(nkl!$A$2:$Q$36,B147)=0,\"\",COUNTIF(nkl!$A$2:$Q$36,B147))","v":""},"-"]
[147,null,{"$f":"IF(COUNTIF(ndst!$A$2:$Q$36,B148)=0,\"\",COUNTIF(ndst!$A$2:$Q$36,B148))","v":""},{"$f":"IF(COUNTIF(nkl!$A$2:$Q$36,B148)=0,\"\",COUNTIF(nkl!$A$2:$Q$36,B148))","v":""},"-"]
[148,null,{"$f":"IF(COUNTIF(ndst!$A$2:$Q$36,B149)=0,\"\",COUNTIF(ndst!$A$2:$Q$36,B149))","v":""},{"$f":"IF(COUNTIF(nkl!$A$2:$Q$36,B149)=0,\"\",COUNTIF(nkl!$A$2:$Q$36,B149))","v":""},"-"]
[149,null,{"$f":"IF(COUNTIF(ndst!$A$2:$Q$36,B150)=0,\"\",COUNTIF(ndst!$A$2:$Q$36,B150))","v":""},{"$f":"IF(COUNTIF(nkl!$A$2:$Q$36,B150)=0,\"\",COUNTIF(nkl!$A$2:$Q$36,B150))","v":""},"-"]
[150,null,{"$f":"IF(COUNTIF(ndst!$A$2:$Q$36,B151)=0,\"\",COUNTIF(ndst!$A$2:$Q$36,B151))","v":""},{"$f":"IF(COUNTIF(nkl!$A$2:$Q$36,B151)=0,\"\",COUNTIF(nkl!$A$2:$Q$36,B151))","v":""},"-"]
[151,null,{"$f":"IF(COUNTIF(ndst!$A$2:$Q$36,B152)=0,\"\",COUNTIF(ndst!$A$2:$Q$36,B152))","v":""},{"$f":"IF(COUNTIF(nkl!$A$2:$Q$36,B152)=0,\"\",COUNTIF(nkl!$A$2:$Q$36,B152))","v":""},"-"]
[152,null,{"$f":"IF(COUNTIF(ndst!$A$2:$Q$36,B153)=0,\"\",COUNTIF(ndst!$A$2:$Q$36,B153))","v":""},{"$f":"IF(COUNTIF(nkl!$A$2:$Q$36,B153)=0,\"\",COUNTIF(nkl!$A$2:$Q$36,B153))","v":""},"-"]
[153,null,{"$f":"IF(COUNTIF(ndst!$A$2:$Q$36,B154)=0,\"\",COUNTIF(ndst!$A$2:$Q$36,B154))","v":""},{"$f":"IF(COUNTIF(nkl!$A$2:$Q$36,B154)=0,\"\",COUNTIF(nkl!$A$2:$Q$36,B154))","v":""},"-"]
[154,null,{"$f":"IF(COUNTIF(ndst!$A$2:$Q$36,B155)=0,\"\",COUNTIF(ndst!$A$2:$Q$36,B155))","v":""},{"$f":"IF(COUNTIF(nkl!$A$2:$Q$36,B155)=0,\"\",COUNTIF(nkl!$A$2:$Q$36,B155))","v":""},"-"]
[155,null,{"$f":"IF(COUNTIF(ndst!$A$2:$Q$36,B156)=0,\"\",COUNTIF(ndst!$A$2:$Q$36,B156))","v":""},{"$f":"IF(COUNTIF(nkl!$A$2:$Q$36,B156)=0,\"\",COUNTIF(nkl!$A$2:$Q$36,B156))","v":""},"-"]
[156,null,{"$f":"IF(COUNTIF(ndst!$A$2:$Q$36,B157)=0,\"\",COUNTIF(ndst!$A$2:$Q$36,B157))","v":""},{"$f":"IF(COUNTIF(nkl!$A$2:$Q$36,B157)=0,\"\",COUNTIF(nkl!$A$2:$Q$36,B157))","v":""},"-"]
[157,null,{"$f":"IF(COUNTIF(ndst!$A$2:$Q$36,B158)=0,\"\",COUNTIF(ndst!$A$2:$Q$36,B158))","v":""},{"$f":"IF(COUNTIF(nkl!$A$2:$Q$36,B158)=0,\"\",COUNTIF(nkl!$A$2:$Q$36,B158))","v":""},"-"]
[158,null,{"$f":"IF(COUNTIF(ndst!$A$2:$Q$36,B159)=0,\"\",COUNTIF(ndst!$A$2:$Q$36,B159))","v":""},{"$f":"IF(COUNTIF(nkl!$A$2:$Q$36,B159)=0,\"\",COUNTIF(nkl!$A$2:$Q$36,B159))","v":""},"-"]
[159,null,{"$f":"IF(COUNTIF(ndst!$A$2:$Q$36,B160)=0,\"\",COUNTIF(ndst!$A$2:$Q$36,B160))","v":""},{"$f":"IF(COUNTIF(nkl!$A$2:$Q$36,B160)=0,\"\",COUNTIF(nkl!$A$2:$Q$36,B160))","v":""},"-"]
[160,null,{"$f":"IF(COUNTIF(ndst!$A$2:$Q$36,B161)=0,\"\",COUNTIF(ndst!$A$2:$Q$36,B161))","v":""},{"$f":"IF(COUNTIF(nkl!$A$2:$Q$36,B161)=0,\"\",COUNTIF(nkl!$A$2:$Q$36,B161))","v":""},"-"]
[161,null,{"$f":"IF(COUNTIF(ndst!$A$2:$Q$36,B162)=0,\"\",COUNTIF(ndst!$A$2:$Q$36,B162))","v":""},{"$f":"IF(COUNTIF(nkl!$A$2:$Q$36,B162)=0,\"\",COUNTIF(nkl!$A$2:$Q$36,B162))","v":""},"-"]
[162,null,{"$f":"IF(COUNTIF(ndst!$A$2:$Q$36,B163)=0,\"\",COUNTIF(ndst!$A$2:$Q$36,B163))","v":""},{"$f":"IF(COUNTIF(nkl!$A$2:$Q$36,B163)=0,\"\",COUNTIF(nkl!$A$2:$Q$36,B163))","v":""},"-"]
[163,null,{"$f":"IF(COUNTIF(ndst!$A$2:$Q$36,B164)=0,\"\",COUNTIF(ndst!$A$2:$Q$36,B164))","v":""},{"$f":"IF(COUNTIF(nkl!$A$2:$Q$36,B164)=0,\"\",COUNTIF(nkl!$A$2:$Q$36,B164))","v":""},"-"]
[164,null,{"$f":"IF(COUNTIF(ndst!$A$2:$Q$36,B165)=0,\"\",COUNTIF(ndst!$A$2:$Q$36,B165))","v":""},{"$f":"IF(COUNTIF(nkl!$A$2:$Q$36,B165)=0,\"\",COUNTIF(nkl!$A$2:$Q$36,B165))","v":""},"-"]
[165,null,{"$f":"IF(COUNTIF(ndst!$A$2:$Q$36,B166)=0,\"\",COUNTIF(ndst!$A$2:$Q$36,B166))","v":""},{"$f":"IF(COUNTIF(nkl!$A$2:$Q$36,B166)=0,\"\",COUNTIF(nkl!$A$2:$Q$36,B166))","v":""},"-"]
[166,null,{"$f":"IF(COUNTIF(ndst!$A$2:$Q$36,B167)=0,\"\",COUNTIF(ndst!$A$2:$Q$36,B167))","v":""},{"$f":"IF(COUNTIF(nkl!$A$2:$Q$36,B167)=0,\"\",COUNTIF(nkl!$A$2:$Q$36,B167))","v":""},"-"]
[167,null,{"$f":"IF(COUNTIF(ndst!$A$2:$Q$36,B168)=0,\"\",COUNTIF(ndst!$A$2:$Q$36,B168))","v":""},{"$f":"IF(COUNTIF(nkl!$A$2:$Q$36,B168)=0,\"\",COUNTIF(nkl!$A$2:$Q$36,B168))","v":""},"-"]
[168,null,{"$f":"IF(COUNTIF(ndst!$A$2:$Q$36,B169)=0,\"\",COUNTIF(ndst!$A$2:$Q$36,B169))","v":""},{"$f":"IF(COUNTIF(nkl!$A$2:$Q$36,B169)=0,\"\",COUNTIF(nkl!$A$2:$Q$36,B169))","v":""},"-"]
[169,null,{"$f":"IF(COUNTIF(ndst!$A$2:$Q$36,B170)=0,\"\",COUNTIF(ndst!$A$2:$Q$36,B170))","v":""},{"$f":"IF(COUNTIF(nkl!$A$2:$Q$36,B170)=0,\"\",COUNTIF(nkl!$A$2:$Q$36,B170))","v":""},"-"]
[170,null,{"$f":"IF(COUNTIF(ndst!$A$2:$Q$36,B171)=0,\"\",COUNTIF(ndst!$A$2:$Q$36,B171))","v":""},{"$f":"IF(COUNTIF(nkl!$A$2:$Q$36,B171)=0,\"\",COUNTIF(nkl!$A$2:$Q$36,B171))","v":""},"-"]
[171,null,{"$f":"IF(COUNTIF(ndst!$A$2:$Q$36,B172)=0,\"\",COUNTIF(ndst!$A$2:$Q$36,B172))","v":""},{"$f":"IF(COUNTIF(nkl!$A$2:$Q$36,B172)=0,\"\",COUNTIF(nkl!$A$2:$Q$36,B172))","v":""},"-"]
[172,null,{"$f":"IF(COUNTIF(ndst!$A$2:$Q$36,B173)=0,\"\",COUNTIF(ndst!$A$2:$Q$36,B173))","v":""},{"$f":"IF(COUNTIF(nkl!$A$2:$Q$36,B173)=0,\"\",COUNTIF(nkl!$A$2:$Q$36,B173))","v":""},"-"]
[173,null,{"$f":"IF(COUNTIF(ndst!$A$2:$Q$36,B174)=0,\"\",COUNTIF(ndst!$A$2:$Q$36,B174))","v":""},{"$f":"IF(COUNTIF(nkl!$A$2:$Q$36,B174)=0,\"\",COUNTIF(nkl!$A$2:$Q$36,B174))","v":""},"-"]
[174,null,{"$f":"IF(COUNTIF(ndst!$A$2:$Q$36,B175)=0,\"\",COUNTIF(ndst!$A$2:$Q$36,B175))","v":""},{"$f":"IF(COUNTIF(nkl!$A$2:$Q$36,B175)=0,\"\",COUNTIF(nkl!$A$2:$Q$36,B175))","v":""},"-"]
[175,null,{"$f":"IF(COUNTIF(ndst!$A$2:$Q$36,B176)=0,\"\",COUNTIF(ndst!$A$2:$Q$36,B176))","v":""},{"$f":"IF(COUNTIF(nkl!$A$2:$Q$36,B176)=0,\"\",COUNTIF(nkl!$A$2:$Q$36,B176))","v":""},"-"]
[176,null,{"$f":"IF(COUNTIF(ndst!$A$2:$Q$36,B177)=0,\"\",COUNTIF(ndst!$A$2:$Q$36,B177))","v":""},{"$f":"IF(COUNTIF(nkl!$A$2:$Q$36,B177)=0,\"\",COUNTIF(nkl!$A$2:$Q$36,B177))","v":""},"-"]
[177,null,{"$f":"IF(COUNTIF(ndst!$A$2:$Q$36,B178)=0,\"\",COUNTIF(ndst!$A$2:$Q$36,B178))","v":""},{"$f":"IF(COUNTIF(nkl!$A$2:$Q$36,B178)=0,\"\",COUNTIF(nkl!$A$2:$Q$36,B178))","v":""},"-"]
[178,null,{"$f":"IF(COUNTIF(ndst!$A$2:$Q$36,B179)=0,\"\",COUNTIF(ndst!$A$2:$Q$36,B179))","v":""},{"$f":"IF(COUNTIF(nkl!$A$2:$Q$36,B179)=0,\"\",COUNTIF(nkl!$A$2:$Q$36,B179))","v":""},"-"]
[179,null,{"$f":"IF(COUNTIF(ndst!$A$2:$Q$36,B180)=0,\"\",COUNTIF(ndst!$A$2:$Q$36,B180))","v":""},{"$f":"IF(COUNTIF(nkl!$A$2:$Q$36,B180)=0,\"\",COUNTIF(nkl!$A$2:$Q$36,B180))","v":""},"-"]
[180,null,{"$f":"IF(COUNTIF(ndst!$A$2:$Q$36,B181)=0,\"\",COUNTIF(ndst!$A$2:$Q$36,B181))","v":""},{"$f":"IF(COUNTIF(nkl!$A$2:$Q$36,B181)=0,\"\",COUNTIF(nkl!$A$2:$Q$36,B181))","v":""},"-"]
[181,null,{"$f":"IF(COUNTIF(ndst!$A$2:$Q$36,B182)=0,\"\",COUNTIF(ndst!$A$2:$Q$36,B182))","v":""},{"$f":"IF(COUNTIF(nkl!$A$2:$Q$36,B182)=0,\"\",COUNTIF(nkl!$A$2:$Q$36,B182))","v":""},"-"]
[182,null,{"$f":"IF(COUNTIF(ndst!$A$2:$Q$36,B183)=0,\"\",COUNTIF(ndst!$A$2:$Q$36,B183))","v":""},{"$f":"IF(COUNTIF(nkl!$A$2:$Q$36,B183)=0,\"\",COUNTIF(nkl!$A$2:$Q$36,B183))","v":""},"-"]
[183,null,{"$f":"IF(COUNTIF(ndst!$A$2:$Q$36,B184)=0,\"\",COUNTIF(ndst!$A$2:$Q$36,B184))","v":""},{"$f":"IF(COUNTIF(nkl!$A$2:$Q$36,B184)=0,\"\",COUNTIF(nkl!$A$2:$Q$36,B184))","v":""},"-"]
[184,null,{"$f":"IF(COUNTIF(ndst!$A$2:$Q$36,B185)=0,\"\",COUNTIF(ndst!$A$2:$Q$36,B185))","v":""},{"$f":"IF(COUNTIF(nkl!$A$2:$Q$36,B185)=0,\"\",COUNTIF(nkl!$A$2:$Q$36,B185))","v":""},"-"]
[185,null,{"$f":"IF(COUNTIF(ndst!$A$2:$Q$36,B186)=0,\"\",COUNTIF(ndst!$A$2:$Q$36,B186))","v":""},{"$f":"IF(COUNTIF(nkl!$A$2:$Q$36,B186)=0,\"\",COUNTIF(nkl!$A$2:$Q$36,B186))","v":""},"-"]
[186,null,{"$f":"IF(COUNTIF(ndst!$A$2:$Q$36,B187)=0,\"\",COUNTIF(ndst!$A$2:$Q$36,B187))","v":""},{"$f":"IF(COUNTIF(nkl!$A$2:$Q$36,B187)=0,\"\",COUNTIF(nkl!$A$2:$Q$36,B187))","v":""},"-"]
[187,null,{"$f":"IF(COUNTIF(ndst!$A$2:$Q$36,B188)=0,\"\",COUNTIF(ndst!$A$2:$Q$36,B188))","v":""},{"$f":"IF(COUNTIF(nkl!$A$2:$Q$36,B188)=0,\"\",COUNTIF(nkl!$A$2:$Q$36,B188))","v":""},"-"]
[188,null,{"$f":"IF(COUNTIF(ndst!$A$2:$Q$36,B189)=0,\"\",COUNTIF(ndst!$A$2:$Q$36,B189))","v":""},{"$f":"IF(COUNTIF(nkl!$A$2:$Q$36,B189)=0,\"\",COUNTIF(nkl!$A$2:$Q$36,B189))","v":""},"-"]
[189,null,{"$f":"IF(COUNTIF(ndst!$A$2:$Q$36,B190)=0,\"\",COUNTIF(ndst!$A$2:$Q$36,B190))","v":""},{"$f":"IF(COUNTIF(nkl!$A$2:$Q$36,B190)=0,\"\",COUNTIF(nkl!$A$2:$Q$36,B190))","v":""},"-"]
[190,null,{"$f":"IF(COUNTIF(ndst!$A$2:$Q$36,B191)=0,\"\",COUNTIF(ndst!$A$2:$Q$36,B191))","v":""},{"$f":"IF(COUNTIF(nkl!$A$2:$Q$36,B191)=0,\"\",COUNTIF(nkl!$A$2:$Q$36,B191))","v":""},"-"]
[191,null,{"$f":"IF(COUNTIF(ndst!$A$2:$Q$36,B192)=0,\"\",COUNTIF(ndst!$A$2:$Q$36,B192))","v":""},{"$f":"IF(COUNTIF(nkl!$A$2:$Q$36,B192)=0,\"\",COUNTIF(nkl!$A$2:$Q$36,B192))","v":""},"-"]
[192,null,{"$f":"IF(COUNTIF(ndst!$A$2:$Q$36,B193)=0,\"\",COUNTIF(ndst!$A$2:$Q$36,B193))","v":""},{"$f":"IF(COUNTIF(nkl!$A$2:$Q$36,B193)=0,\"\",COUNTIF(nkl!$A$2:$Q$36,B193))","v":""},"-"]
[193,null,{"$f":"IF(COUNTIF(ndst!$A$2:$Q$36,B194)=0,\"\",COUNTIF(ndst!$A$2:$Q$36,B194))","v":""},{"$f":"IF(COUNTIF(nkl!$A$2:$Q$36,B194)=0,\"\",COUNTIF(nkl!$A$2:$Q$36,B194))","v":""},"-"]
[194,null,{"$f":"IF(COUNTIF(ndst!$A$2:$Q$36,B195)=0,\"\",COUNTIF(ndst!$A$2:$Q$36,B195))","v":""},{"$f":"IF(COUNTIF(nkl!$A$2:$Q$36,B195)=0,\"\",COUNTIF(nkl!$A$2:$Q$36,B195))","v":""},{"$f":"IF(C195&D195<>\"\",\"tak\",\"-\")","v":"-"}]
[195,null,{"$f":"IF(COUNTIF(ndst!$A$2:$Q$36,B196)=0,\"\",COUNTIF(ndst!$A$2:$Q$36,B196))","v":""},{"$f":"IF(COUNTIF(nkl!$A$2:$Q$36,B196)=0,\"\",COUNTIF(nkl!$A$2:$Q$36,B196))","v":""},"-"]
[196,null,{"$f":"IF(COUNTIF(ndst!$A$2:$Q$36,B197)=0,\"\",COUNTIF(ndst!$A$2:$Q$36,B197))","v":""},{"$f":"IF(COUNTIF(nkl!$A$2:$Q$36,B197)=0,\"\",COUNTIF(nkl!$A$2:$Q$36,B197))","v":""},"-"]
[197,null,{"$f":"IF(COUNTIF(ndst!$A$2:$Q$36,B198)=0,\"\",COUNTIF(ndst!$A$2:$Q$36,B198))","v":""},{"$f":"IF(COUNTIF(nkl!$A$2:$Q$36,B198)=0,\"\",COUNTIF(nkl!$A$2:$Q$36,B198))","v":""},"-"]
[198,null,{"$f":"IF(COUNTIF(ndst!$A$2:$Q$36,B199)=0,\"\",COUNTIF(ndst!$A$2:$Q$36,B199))","v":""},{"$f":"IF(COUNTIF(nkl!$A$2:$Q$36,B199)=0,\"\",COUNTIF(nkl!$A$2:$Q$36,B199))","v":""},"-"]
[199,null,{"$f":"IF(COUNTIF(ndst!$A$2:$Q$36,B200)=0,\"\",COUNTIF(ndst!$A$2:$Q$36,B200))","v":""},{"$f":"IF(COUNTIF(nkl!$A$2:$Q$36,B200)=0,\"\",COUNTIF(nkl!$A$2:$Q$36,B200))","v":""},"-"]
[200,null,{"$f":"IF(COUNTIF(ndst!$A$2:$Q$36,B201)=0,\"\",COUNTIF(ndst!$A$2:$Q$36,B201))","v":""},{"$f":"IF(COUNTIF(nkl!$A$2:$Q$36,B201)=0,\"\",COUNTIF(nkl!$A$2:$Q$36,B201))","v":""},"-"]
[]
[]
[]
[]
[]
[]
[]
[]
[]
[]
[]
[]
[]
[]
[]
[]
[]
[]
[]
[]
[]
[]
[]
[]
[]
[]
[]
[]
[]
[]
[]
[]
[]
[]
[]
[]
[]
[]
[]
[]
[]
[]
[]
[]
[]
[]
[]
[]
[]
[]
[]
[]
[]
[]
[]
[]
[]
[]
[]
[]
[]
[]
[]
[]
[]
[]
[]
[]
[]
[]
[]
[]
[]
[]
[]
[]
[]
[]
[]
[]
[]
[]
[]
[]
[]
[]
[]
[]
[]
[]
[]
[]
[]
[]
[]
[]
[]
[]
[null,"biologia"]
[null,"chemia"]
[null,"edukacja dla bezpieczeństwa"]
[null,"fizyka"]
[null,"geografia"]
[null,"historia"]
[null,"historia i społeczeństwo"]
[null,"informatyka"]
[null,"język angielski"]
[null,"język francuski"]
[null,"język niemiecki"]
[null,"język polski"]
[null,"język rosyjski"]
[null,"komunikacja medialna"]
[null,"matematyka"]
[null,"przyroda"]
[null,"wiedza o kulturze"]
[null,"wiedza o społeczeństwie"]
[null,"wychowanie fizyczne"]
[null,"religia"]